Opened 16 years ago

Closed 15 years ago

#1851 enhancement closed fixed (fixed)

Svn python 2.4 Suse 9, 64 bit

Reported by: scmikes Owned by: scmikes
Priority: normal Milestone: Core-2.5
Component: core Keywords: suse9 64bit twisted trial test run results
Cc: scmikes, Jean-Paul Calderone Branch:
Author:

Description

Here is the Python 2.4 version of ticket #1848

Suse 9 , 64 bit Python 2.4

Twisted SVN co version #

Ran 895 tests in 179.913s

FAILED (skips=53, expectedFailures=4, failures=7, errors=17, successes=820) $

Attachments (3)

trial_python2.4.out (102.3 KB) - added by scmikes 16 years ago.
trial_python2.4.2.out (102.3 KB) - added by scmikes 16 years ago.
test.log (281.5 KB) - added by scmikes 16 years ago.

Download all attachments as: .zip

Change History (6)

Changed 16 years ago by scmikes

Attachment: trial_python2.4.out added

Changed 16 years ago by scmikes

Attachment: trial_python2.4.2.out added

Changed 16 years ago by scmikes

Attachment: test.log added

comment:1 Changed 16 years ago by Jean-Paul Calderone

Cc: scmikes Jean-Paul Calderone added
Owner: changed from Glyph to scmikes

Are you sure this is Python 2.4?

Note the following:

pythonexarkun@kunai:~$ python
Python 2.4.3 (#2, Apr 27 2006, 14:43:58)
[GCC 4.0.3 (Ubuntu 4.0.3-1ubuntu5)] on linux2
Type "help", "copyright", "credits" or "license" for more information.
>>> from twisted.python import failure
>>> try:
...     1/0
... except:
...     failure.Failure().printTraceback()
...
Traceback (most recent call last):
--- <exception caught here> ---
  File "<stdin>", line 2, in ?

exceptions.ZeroDivisionError: integer division or modulo by zero
>>>
Python 2.5a2 (trunk:46477, May 27 2006, 12:22:09)
[GCC 4.0.3 (Ubuntu 4.0.3-1ubuntu5)] on linux2
Type "help", "copyright", "credits" or "license" for more information.
>>> from twisted.python import failure
>>> try:
...     1/0
... except:
...     failure.Failure().printTraceback()
... 
Traceback (most recent call last):
--- <exception caught here> ---
  File "<stdin>", line 2, in <module>
    
<type 'exceptions.ZeroDivisionError'>: integer division or modulo by zero
>>> 

The log attached looks more like a Python 2.5 log.

comment:2 Changed 16 years ago by scmikes

Status: newassigned

Let me build pycrypto on Monday (machine is being updated this weekend).

And I will rerun.

comment:3 Changed 15 years ago by scmikes

Resolution: fixed
Status: assignedclosed

created suse buildbot

Note: See TracTickets for help on using tickets.