Ticket #6852: trial_log_6852.2.txt

File trial_log_6852.2.txt, 3.6 KB (added by Tobias Oberstein, 7 years ago)
Line 
1[bbslave_twisted@tvd_build_txpypy ~/scm/twisted]$ which trial
2/home/bbslave_twisted/python276/bin/trial
3
4[bbslave_twisted@tvd_build_txpypy ~/scm/twisted]$ cat /home/bbslave_twisted/python276/bin/trial
5#!/home/bbslave_twisted/python276/bin/python
6# EASY-INSTALL-SCRIPT: 'Twisted==13.2.0','trial'
7__requires__ = 'Twisted==13.2.0'
8import pkg_resources
9pkg_resources.run_script('Twisted==13.2.0', 'trial')
10
11[bbslave_twisted@tvd_build_txpypy ~/scm/twisted]$ trial --reactor=kqueue twisted
12twisted.application.test.test_internet
13  TestEndpointService
14    test_failReportsError ...                                              [OK]
15    test_privilegedStartService ...                                        [OK]
16
17...
18
19[ERROR]
20Traceback (most recent call last):
21Failure: twisted.internet.defer.TimeoutError: <twisted.test.test_iutils.ProcessUtilsTests testMethod=test_outputWithErrorIgnored> (test_outputWithErrorIgnored) still running at 120.0 secs
22
23twisted.test.test_iutils.ProcessUtilsTests.test_outputWithErrorIgnored
24===============================================================================
25[ERROR]
26Traceback (most recent call last):
27Failure: twisted.trial.util.DirtyReactorAggregateError: Reactor was unclean.
28Selectables:
29<twisted.internet.process.ProcessWriter object at 0x80f470110>
30
31twisted.test.test_iutils.ProcessUtilsTests.test_outputWithErrorIgnored
32===============================================================================
33[ERROR]
34Traceback (most recent call last):
35  File "/home/bbslave_twisted/scm/twisted/twisted/test/test_log.py", line 371, in test_getTimezoneOffset
36    utcDaylightTimestamp = time.mktime(localDaylightTuple)
37exceptions.OverflowError: mktime argument out of range
38
39twisted.test.test_log.FileObserverTestCase.test_getTimezoneOffset
40-------------------------------------------------------------------------------
41Ran 9397 tests in 454.742s
42
43FAILED (skips=1455, expectedFailures=12, errors=3, successes=7928)
44
45[bbslave_twisted@tvd_build_txpypy ~/scm/twisted]$ trial --reactor=kqueue twisted.test.test_iutils.ProcessUtilsTests.test_outputWithErrorIgnored
46twisted.test.test_iutils
47  ProcessUtilsTests
48    test_outputWithErrorIgnored ...                                        [OK]
49
50-------------------------------------------------------------------------------
51Ran 1 tests in 0.925s
52
53PASSED (successes=1)
54
55[bbslave_twisted@tvd_build_txpypy ~/scm/twisted]$ trial --reactor=kqueue twisted.test.test_iutils.ProcessUtilsTests
56twisted.test.test_iutils
57  ProcessUtilsTests
58    test_getProcessOutputAndValueDefaultPath ...                           [OK]
59    test_getProcessOutputAndValuePath ...                                  [OK]
60    test_getProcessOutputDefaultPath ...                                   [OK]
61    test_getProcessOutputPath ...                                          [OK]
62    test_getProcessValueDefaultPath ...                                    [OK]
63    test_getProcessValuePath ...                                           [OK]
64    test_output ...                                                        [OK]
65    test_outputAndValue ...                                                [OK]
66    test_outputSignal ...                                                  [OK]
67    test_outputWithErrorCollected ...                                      [OK]
68    test_outputWithErrorIgnored ...                                        [OK]
69    test_value ...                                                         [OK]
70
71-------------------------------------------------------------------------------
72Ran 12 tests in 1.504s
73
74PASSED (successes=12)