Ticket #5907: openbsd-52-i386-trial-errors.txt

File openbsd-52-i386-trial-errors.txt, 17.2 KB (added by teratorn, 23 months ago)
Line 
1===============================================================================
2[FAIL]
3Traceback (most recent call last):
4  File "/home/teratorn/code/TX/lib/python2.7/site-packages/twisted/internet/defer.py", line 138, in maybeDeferred
5    result = f(*args, **kw)
6  File "/home/teratorn/code/TX/lib/python2.7/site-packages/twisted/internet/_utilspy3.py", line 41, in runWithWarningsSuppressed
7    reraise(exc_info[1], exc_info[2])
8  File "/home/teratorn/code/TX/lib/python2.7/site-packages/twisted/internet/_utilspy3.py", line 37, in runWithWarningsSuppressed
9    result = f(*a, **kw)
10  File "/home/teratorn/code/TX/lib/python2.7/site-packages/twisted/internet/test/test_posixprocess.py", line 340, in test_expectedFDs
11    self.assertNotIn(fd, process._listOpenFDs())
12  File "/home/teratorn/code/TX/lib/python2.7/site-packages/twisted/trial/_synctest.py", line 433, in assertNotIn
13    % (containee, container))
14twisted.trial.unittest.FailTest: 60 in [0, 1, 2, 3, 4, 5, 6, 7, 8, 9, 10, 11, 12, 13, 14, 15, 16, 17, 18, 19, 20, 21, 22, 23, 24, 25, 26, 27, 28, 29, 30, 31, 32, 33, 34, 35, 36, 37, 38, 39, 40, 41, 42, 43, 44, 45, 46, 47, 48, 49, 50, 51, 52, 53, 54, 55, 56, 57, 58, 59, 60, 61, 62, 63, 64, 65, 66, 67, 68, 69, 70, 71, 72, 73, 74, 75, 76, 77, 78, 79, 80, 81, 82, 83, 84, 85, 86, 87, 88, 89, 90, 91, 92, 93, 94, 95, 96, 97, 98, 99, 100, 101, 102, 103, 104, 105, 106, 107, 108, 109, 110, 111, 112, 113, 114, 115, 116, 117, 118, 119, 120, 121, 122, 123, 124, 125, 126, 127, 128, 129, 130, 131, 132, 133, 134, 135, 136, 137, 138, 139, 140, 141, 142, 143, 144, 145, 146, 147, 148, 149, 150, 151, 152, 153, 154, 155, 156, 157, 158, 159, 160, 161, 162, 163, 164, 165, 166, 167, 168, 169, 170, 171, 172, 173, 174, 175, 176, 177, 178, 179, 180, 181, 182, 183, 184, 185, 186, 187, 188, 189, 190, 191, 192, 193, 194, 195, 196, 197, 198, 199, 200, 201, 202, 203, 204, 205, 206, 207, 208, 209, 210, 211, 212, 213, 214, 215, 216, 217, 218, 219, 220, 221, 222, 223, 224, 225, 226, 227, 228, 229, 230, 231, 232, 233, 234, 235, 236, 237, 238, 239, 240, 241, 242, 243, 244, 245, 246, 247, 248, 249, 250, 251, 252, 253, 254, 255, 256, 257, 258, 259, 260, 261, 262, 263, 264, 265, 266, 267, 268, 269, 270, 271, 272, 273, 274, 275, 276, 277, 278, 279, 280, 281, 282, 283, 284, 285, 286, 287, 288, 289, 290, 291, 292, 293, 294, 295, 296, 297, 298, 299, 300, 301, 302, 303, 304, 305, 306, 307, 308, 309, 310, 311, 312, 313, 314, 315, 316, 317, 318, 319, 320, 321, 322, 323, 324, 325, 326, 327, 328, 329, 330, 331, 332, 333, 334, 335, 336, 337, 338, 339, 340, 341, 342, 343, 344, 345, 346, 347, 348, 349, 350, 351, 352, 353, 354, 355, 356, 357, 358, 359, 360, 361, 362, 363, 364, 365, 366, 367, 368, 369, 370, 371, 372, 373, 374, 375, 376, 377, 378, 379, 380, 381, 382, 383, 384, 385, 386, 387, 388, 389, 390, 391, 392, 393, 394, 395, 396, 397, 398, 399, 400, 401, 402, 403, 404, 405, 406, 407, 408, 409, 410, 411, 412, 413, 414, 415, 416, 417, 418, 419, 420, 421, 422, 423, 424, 425, 426, 427, 428, 429, 430, 431, 432, 433, 434, 435, 436, 437, 438, 439, 440, 441, 442, 443, 444, 445, 446, 447, 448, 449, 450, 451, 452, 453, 454, 455, 456, 457, 458, 459, 460, 461, 462, 463, 464, 465, 466, 467, 468, 469, 470, 471, 472, 473, 474, 475, 476, 477, 478, 479, 480, 481, 482, 483, 484, 485, 486, 487, 488, 489, 490, 491, 492, 493, 494, 495, 496, 497, 498, 499, 500, 501, 502, 503, 504, 505, 506, 507, 508, 509, 510, 511, 512, 513, 514, 515, 516, 517, 518, 519, 520, 521, 522, 523, 524, 525, 526, 527, 528, 529, 530, 531, 532, 533, 534, 535, 536, 537, 538, 539, 540, 541, 542, 543, 544, 545, 546, 547, 548, 549, 550, 551, 552, 553, 554, 555, 556, 557, 558, 559, 560, 561, 562, 563, 564, 565, 566, 567, 568, 569, 570, 571, 572, 573, 574, 575, 576, 577, 578, 579, 580, 581, 582, 583, 584, 585, 586, 587, 588, 589, 590, 591, 592, 593, 594, 595, 596, 597, 598, 599, 600, 601, 602, 603, 604, 605, 606, 607, 608, 609, 610, 611, 612, 613, 614, 615, 616, 617, 618, 619, 620, 621, 622, 623, 624, 625, 626, 627, 628, 629, 630, 631, 632, 633, 634, 635, 636, 637, 638, 639, 640, 641, 642, 643, 644, 645, 646, 647, 648, 649, 650, 651, 652, 653, 654, 655, 656, 657, 658, 659, 660, 661, 662, 663, 664, 665, 666, 667, 668, 669, 670, 671, 672, 673, 674, 675, 676, 677, 678, 679, 680, 681, 682, 683, 684, 685, 686, 687, 688, 689, 690, 691, 692, 693, 694, 695, 696, 697, 698, 699, 700, 701, 702, 703, 704, 705, 706, 707, 708, 709, 710, 711, 712, 713, 714, 715, 716, 717, 718, 719, 720, 721, 722, 723, 724, 725, 726, 727, 728, 729, 730, 731, 732, 733, 734, 735, 736, 737, 738, 739, 740, 741, 742, 743, 744, 745, 746, 747, 748, 749, 750, 751, 752, 753, 754, 755, 756, 757, 758, 759, 760, 761, 762, 763, 764, 765, 766, 767, 768, 769, 770, 771, 772, 773, 774, 775, 776, 777, 778, 779, 780, 781, 782, 783, 784, 785, 786, 787, 788, 789, 790, 791, 792, 793, 794, 795, 796, 797, 798, 799, 800, 801, 802, 803, 804, 805, 806, 807, 808, 809, 810, 811, 812, 813, 814, 815, 816, 817, 818, 819, 820, 821, 822, 823, 824, 825, 826, 827, 828, 829, 830, 831, 832,
15
16twisted.internet.test.test_posixprocess.FileDescriptorTests.test_expectedFDs
17===============================================================================
18[FAIL]
19Traceback (most recent call last):
20  File "/home/teratorn/code/TX/lib/python2.7/site-packages/twisted/internet/defer.py", line 138, in maybeDeferred
21    result = f(*args, **kw)
22  File "/home/teratorn/code/TX/lib/python2.7/site-packages/twisted/internet/_utilspy3.py", line 41, in runWithWarningsSuppressed
23    reraise(exc_info[1], exc_info[2])
24  File "/home/teratorn/code/TX/lib/python2.7/site-packages/twisted/internet/_utilspy3.py", line 37, in runWithWarningsSuppressed
25    result = f(*a, **kw)
26  File "/home/teratorn/code/TX/lib/python2.7/site-packages/twisted/python/test/test_sendmsg.py", line 541, in test_unix
27    self.assertEqual(AF_UNIX, getsockfam(self._socket(AF_UNIX)))
28  File "/home/teratorn/code/TX/lib/python2.7/site-packages/twisted/trial/_synctest.py", line 356, in assertEqual
29    % (msg, pformat(first), pformat(second)))
30twisted.trial.unittest.FailTest: not equal:
31a = 1
32b = 224
33
34
35twisted.python.test.test_sendmsg.GetSocketFamilyTests.test_unix
36===============================================================================
37[FAIL]
38Traceback (most recent call last):
39  File "/home/teratorn/code/TX/lib/python2.7/site-packages/twisted/internet/defer.py", line 138, in maybeDeferred
40    result = f(*args, **kw)
41  File "/home/teratorn/code/TX/lib/python2.7/site-packages/twisted/internet/_utilspy3.py", line 41, in runWithWarningsSuppressed
42    reraise(exc_info[1], exc_info[2])
43  File "/home/teratorn/code/TX/lib/python2.7/site-packages/twisted/internet/_utilspy3.py", line 37, in runWithWarningsSuppressed
44    result = f(*a, **kw)
45  File "/home/teratorn/code/TX/lib/python2.7/site-packages/twisted/test/test_plugin.py", line 566, in test_newPluginsOnReadOnlyPath
46    "events: %r" % (events,))
47twisted.trial.unittest.FailTest: Did not observe unwriteable cache warning in log events: []
48
49twisted.test.test_plugin.DeveloperSetupTests.test_newPluginsOnReadOnlyPath
50===============================================================================
51[FAIL]
52Traceback (most recent call last):
53  File "/home/teratorn/code/TX/lib/python2.7/site-packages/twisted/internet/defer.py", line 138, in maybeDeferred
54    result = f(*args, **kw)
55  File "/home/teratorn/code/TX/lib/python2.7/site-packages/twisted/internet/_utilspy3.py", line 41, in runWithWarningsSuppressed
56    reraise(exc_info[1], exc_info[2])
57  File "/home/teratorn/code/TX/lib/python2.7/site-packages/twisted/internet/_utilspy3.py", line 37, in runWithWarningsSuppressed
58    result = f(*a, **kw)
59  File "/home/teratorn/code/TX/lib/python2.7/site-packages/twisted/test/test_plugin.py", line 336, in test_deployedMode
60    "events: %r" % (events,))
61twisted.trial.unittest.FailTest: Did not observe unwriteable cache warning in log events: []
62
63twisted.test.test_plugin.PluginTestCase.test_deployedMode
64===============================================================================
65[FAIL]
66Traceback (most recent call last):
67  File "/home/teratorn/code/TX/lib/python2.7/site-packages/twisted/web/test/test_static.py", line 147, in cbRendered
68    self.assertEqual(request.responseCode, 403)
69  File "/home/teratorn/code/TX/lib/python2.7/site-packages/twisted/trial/_synctest.py", line 356, in assertEqual
70    % (msg, pformat(first), pformat(second)))
71twisted.trial.unittest.FailTest: not equal:
72a = 200
73b = 403
74
75
76twisted.web.test.test_static.StaticFileTests.test_forbiddenResource
77===============================================================================
78[FAIL]
79Traceback (most recent call last):
80  File "/home/teratorn/code/TX/lib/python2.7/site-packages/twisted/trial/_asynctest.py", line 66, in _cb
81    "did not catch an error, instead got %r" % (ignore,))
82twisted.trial.unittest.FailTest: did not catch an error, instead got None
83
84twisted.web.test.test_webclient.WebClientTestCase.testDownloadPageError3
85===============================================================================
86[ERROR]
87Traceback (most recent call last):
88  File "/home/teratorn/code/TX/lib/python2.7/site-packages/twisted/internet/test/test_process.py", line 365, in test_openFileDescriptors
89    self.runReactor(reactor)
90  File "/home/teratorn/code/TX/lib/python2.7/site-packages/twisted/internet/test/reactormixins.py", line 292, in runReactor
91    "reactor still running after %s seconds" % (timeout,))
92twisted.internet.test.reactormixins.TestTimeoutError: reactor still running after 120.0 seconds
93
94twisted.internet.test.test_process.PTYProcessTestsBuilder_KQueueReactor.test_openFileDescriptors
95===============================================================================
96[ERROR]
97Traceback (most recent call last):
98  File "/home/teratorn/code/TX/lib/python2.7/site-packages/twisted/internet/_baseprocess.py", line 60, in maybeCallProcessEnded
99    proto.processEnded(Failure(reason))
100  File "/home/teratorn/code/TX/lib/python2.7/site-packages/twisted/internet/test/test_process.py", line 358, in processEnded
101    reactor.stop()
102  File "/home/teratorn/code/TX/lib/python2.7/site-packages/twisted/internet/base.py", line 582, in stop
103    "Can't stop reactor that isn't running.")
104twisted.internet.error.ReactorNotRunning: Can't stop reactor that isn't running.
105
106twisted.internet.test.test_process.PTYProcessTestsBuilder_KQueueReactor.test_processExitedWithSignal
107===============================================================================
108[ERROR]
109Traceback (most recent call last):
110  File "/home/teratorn/code/TX/lib/python2.7/site-packages/twisted/internet/test/test_process.py", line 83, in test_processTransportInterface
111    self.runReactor(reactor)
112  File "/home/teratorn/code/TX/lib/python2.7/site-packages/twisted/internet/test/reactormixins.py", line 292, in runReactor
113    "reactor still running after %s seconds" % (timeout,))
114twisted.internet.test.reactormixins.TestTimeoutError: reactor still running after 120.0 seconds
115
116twisted.internet.test.test_process.PTYProcessTestsBuilder_KQueueReactor.test_processTransportInterface
117===============================================================================
118[ERROR]
119Traceback (most recent call last):
120  File "/home/teratorn/code/TX/lib/python2.7/site-packages/twisted/internet/test/test_process.py", line 216, in test_spawnProcessEarlyIsReaped
121    self.runReactor(reactor)
122  File "/home/teratorn/code/TX/lib/python2.7/site-packages/twisted/internet/test/reactormixins.py", line 292, in runReactor
123    "reactor still running after %s seconds" % (timeout,))
124twisted.internet.test.reactormixins.TestTimeoutError: reactor still running after 120.0 seconds
125
126twisted.internet.test.test_process.PTYProcessTestsBuilder_KQueueReactor.test_spawnProcessEarlyIsReaped
127===============================================================================
128[ERROR]
129Traceback (most recent call last):
130  File "/home/teratorn/code/TX/lib/python2.7/site-packages/twisted/internet/_baseprocess.py", line 60, in maybeCallProcessEnded
131    proto.processEnded(Failure(reason))
132  File "/home/teratorn/code/TX/lib/python2.7/site-packages/twisted/internet/test/test_process.py", line 356, in processEnded
133    checkOutput("".join(self.output))
134  File "/home/teratorn/code/TX/lib/python2.7/site-packages/twisted/internet/test/test_process.py", line 343, in checkOutput
135    self.assertEqual('[0, 1, 2, 3]', output)
136  File "/home/teratorn/code/TX/lib/python2.7/site-packages/twisted/trial/_synctest.py", line 356, in assertEqual
137    % (msg, pformat(first), pformat(second)))
138twisted.trial.unittest.FailTest: not equal:
139a = '[0, 1, 2, 3]'
140b = '[0, 1, 2, 3, 4, 5, 6, 7, 8, 9, 10, 11, 12, 13, 14, 15, 16, 17, 18, 19, 20, 21, 22, 23, 24, 25, 26, 27, 28, 29, 30, 31, 32, 33, 34, 35, 36, 37, 38, 39, 40, 41, 42, 43, 44, 45, 46, 47, 48, 49, 50, 51, 52, 53, 54, 55, 56, 57, 58, 59, 60, 61, 62, 63, 64, 65, 66, 67, 68, 69, 70, 71, 72, 73, 74, 75, 76, 77, 78, 79, 80, 81, 82, 83, 84, 85, 86, 87, 88, 89, 90, 91, 92, 93, 94, 95, 96, 97, 98, 99, 100, 101, 102, 103, 104, 105, 106, 107, 108, 109, 110, 111, 112, 113, 114, 115, 116, 117, 118, 119, 120, 121, 122, 123, 124, 125, 126, 127, 128, 129, 130, 131, 132, 133, 134, 135, 136, 137, 138, 139, 140, 141, 142, 143, 144, 145, 146, 147, 148, 149, 150, 151, 152, 153, 154, 155, 156, 157, 158, 159, 160, 161, 162, 163, 164, 165, 166, 167, 168, 169, 170, 171, 172, 173, 174, 175, 176, 177, 178, 179, 180, 181, 182, 183, 184, 185, 186, 187, 188, 189, 190, 191, 192, 193, 194, 195, 196, 197, 198, 199, 200, 201, 202, 203, 204, 205, 206, 207, 208, 209, 210, 211, 212, 213, 214, 215, 216, 217, 218, 219, 220, 221, 222, 223, 224, 225, 226, 227, 228, 229, 230, 231, 232, 233, 234, 235, 236, 237, 238, 239, 240, 241, 242, 243, 244, 245, 246, 247, 248, 249, 250, 251, 252, 253, 254, 255, 256, 257, 258, 259, 260, 261, 262, 263, 264, 265, 266, 267, 268, 269, 270, 271, 272, 273, 274, 275, 276, 277, 278, 279, 280, 281, 282, 283, 284, 285, 286, 287, 288, 289, 290, 291, 292, 293, 294, 295, 296, 297, 298, 299, 300, 301, 302, 303, 304, 305, 306, 307, 308, 309, 310, 311, 312, 313, 314, 315, 316, 317, 318, 319, 320, 321, 322, 323, 324, 325, 326, 327, 328, 329, 330, 331, 332, 333, 334, 335, 336, 337, 338, 339, 340, 341, 342, 343, 344, 345, 346, 347, 348, 349, 350, 351, 352, 353, 354, 355, 356, 357, 358, 359, 360, 361, 362, 363, 364, 365, 366, 367, 368, 369, 370, 371, 372, 373, 374, 375, 376, 377, 378, 379, 380, 381, 382, 383, 384, 385, 386, 387, 388, 389, 390, 391, 392, 393, 394, 395, 396, 397, 398, 399, 400, 401, 402, 403, 404, 405, 406, 407, 408, 409, 410, 411, 412, 413, 414, 415, 416, 417, 418, 419, 420, 421, 422, 423, 424, 425, 426, 427, 428, 429, 430, 431, 432, 433, 434, 435, 436, 437, 438, 439, 440, 441, 442, 443, 444, 445, 446, 447, 448, 449, 450, 451, 452, 453, 454, 455, 456, 457, 458, 459, 460, 461, 462, 463, 464, 465, 466, 467, 468, 469, 470, 471, 472, 473, 474, 475, 476, 477, 478, 479, 480, 481, 482, 483, 484, 485, 486, 487, 488, 489, 490, 491, 492, 493, 494, 495, 496, 497, 498, 499, 500, 501, 502, 503, 504, 505, 506, 507, 508, 509, 510, 511, 512, 513, 514, 515, 516, 517, 518, 519, 520, 521, 522, 523, 524, 525, 526, 527, 528, 529, 530, 531, 532, 533, 534, 535, 536, 537, 538, 539, 540, 541, 542, 543, 544, 545, 546, 547, 548, 549, 550, 551, 552, 553, 554, 555, 556, 557, 558, 559, 560, 561, 562, 563, 564, 565, 566, 567, 568, 569, 570, 571, 572, 573, 574, 575, 576, 577, 578, 579, 580, 581, 582, 583, 584, 585, 586, 587, 588, 589, 590, 591, 592, 593, 594, 595, 596, 597, 598, 599, 600, 601, 602, 603, 604, 605, 606, 607, 608, 609, 610, 611, 612, 613, 614, 615, 616, 617, 618, 619, 620, 621, 622, 623, 624, 625, 626, 627, 628, 629, 630, 631, 632, 633, 634, 635, 636, 637, 638, 639, 640, 641, 642, 643, 644, 645, 646, 647, 648, 649, 650, 651, 652, 653, 654, 655, 656, 657, 658, 659, 660, 661, 662, 663, 664, 665, 666, 667, 668, 669, 670, 671, 672, 673, 674, 675, 676, 677, 678, 679, 680, 681, 682, 683, 684, 685, 686, 687, 688, 689, 690, 691, 692, 693, 694, 695, 696, 697, 698, 699, 700, 701, 702, 703, 704, 705, 706, 707, 708, 709, 710, 711, 712, 713, 714, 715, 716, 717, 718, 719, 720, 721, 722, 723, 724, 725, 726, 727, 728, 729, 730, 731, 732, 733, 734, 735, 736, 737, 738, 739, 740, 741, 742, 743, 744, 745, 746, 747, 748, 749, 750, 751, 752, 753, 754, 755, 756, 757, 758, 759, 760, 761, 762, 763, 764, 765, 766, 767, 768, 769, 770, 771, 772, 773, 774, 775, 776, 777, 778, 779, 780, 781, 782, 783, 784, 785, 786, 787, 788, 789, 790, 791, 792, 793, 794, 795, 796, 797, 798, 799, 800, 801, 802, 803, 804, 805, 806, 807, 808, 809, 810, 811, 812, 813, 814, 815, 816, 817, 818, 819, 820, 821, 822, 823, 824, 825, 826, 827, 828, 829, 830, 831, 832, 833, 834, 835, 836, 837, 838, 839,
141
142
143twisted.internet.test.test_process.PTYProcessTestsBuilder_PollReactor.test_openFileDescriptors
144twisted.internet.test.test_process.PTYProcessTestsBuilder_SelectReactor.test_openFileDescriptors
145twisted.internet.test.test_process.ProcessTestsBuilder_KQueueReactor.test_openFileDescriptors
146twisted.internet.test.test_process.ProcessTestsBuilder_PollReactor.test_openFileDescriptors
147twisted.internet.test.test_process.ProcessTestsBuilder_SelectReactor.test_openFileDescriptors
148===============================================================================
149[SUCCESS!?!]
150Reason: 'skipping 100% cpu hang -teratorn'
151
152twisted.web.test.test_webclient.CookieTestCase.testNoCookies
153-------------------------------------------------------------------------------
154Ran 8663 tests in 609.116s
155
156FAILED (skips=2008, expectedFailures=10, failures=6, errors=9, unexpectedSuccesses=1, successes=6629)