Ticket #5675: test_dns.failures.txt

File test_dns.failures.txt, 1.9 KB (added by lukmdo, 15 months ago)

two test failing (MessageStandardEncodingTests.test_ednsDecode, MessageStandardEncodingTests.test_ednsEncode)

Line 
1trial twisted.names.test.test_dns
2
3===============================================================================
4[FAIL]
5Traceback (most recent call last):
6  File "/Users/serpiente/.virtualenvs/tx27/src/twisted/twisted/names/test/test_dns.py", line 3187, in test_ednsDecode
7    self.assertEqual(m, self.messageFactory(**MESSAGE_EDNS_QUERY.kwargs()))
8  File "/Users/serpiente/.virtualenvs/tx27/src/twisted/twisted/trial/_synctest.py", line 356, in assertEqual
9    % (msg, pformat(first), pformat(second)))
10twisted.trial.unittest.FailTest: not equal:
11a = <MessageComparable id=0 answer=0 opCode=0 auth=0 trunc=0 recDes=0 recAv=0 rCode=0 queries=[Query('www.example.com', 1, 1)] answers=[] authority=[] additional=[<RR name= type=OPT class=UNKNOWN (4096) ttl=196608s auth=False>]>
12b = <MessageComparable id=0 answer=0 opCode=0 auth=0 trunc=0 recDes=0 recAv=0 rCode=0 queries=[Query('www.example.com', 1, 1)] answers=[] authority=[] additional=[]>
13
14
15twisted.names.test.test_dns.MessageStandardEncodingTests.test_ednsDecode
16===============================================================================
17[FAIL]
18Traceback (most recent call last):
19  File "/Users/serpiente/.virtualenvs/tx27/src/twisted/twisted/names/test/test_dns.py", line 3199, in test_ednsEncode
20    MESSAGE_EDNS_QUERY.bytes)
21  File "/Users/serpiente/.virtualenvs/tx27/src/twisted/twisted/trial/_synctest.py", line 356, in assertEqual
22    % (msg, pformat(first), pformat(second)))
23twisted.trial.unittest.FailTest: not equal:
24a = '\x00\x00\x00\x00\x00\x01\x00\x00\x00\x00\x00\x00\x03www\x07example\x03com\x00\x00\x01\x00\x01'
25b = '\x00\x00\x00\x00\x00\x01\x00\x00\x00\x00\x00\x01\x03www\x07example\x03com\x00\x00\x01\x00\x01\x00\x00)\x10\x00\x00\x03\x00\x00\x00\x00'
26
27
28twisted.names.test.test_dns.MessageStandardEncodingTests.test_ednsEncode
29-------------------------------------------------------------------------------
30Ran 197 tests in 0.865s
31
32FAILED (failures=2, successes=195)