Ticket #1918: twisted_errors.txt

File twisted_errors.txt, 44.7 KB (added by psykidellic, 4 years ago)

Cases those failed.

Line 
1Reason: "the traceback is not preserved, exarkun said he'll try to fix this! god knows how"
2Traceback (most recent call last):
3  File "/Users/rnadhani/Codes/Twisted/twisted-kqueue/twisted/test/test_failure.py", line 94, in testLackOfTB
4    self.assertEquals(innerline, '1/0')
5twisted.trial.unittest.FailTest: not equal:
6a = 'raise self.type, self.value, self.tb'
7b = '1/0'
8
9===============================================================================
10[TODO]: twisted.test.test_modules.PathModificationTest.test_underUnderPathNotAlreadyImported
11
12Reason: 'This may be impossible but it sure would be nice.'
13Traceback (most recent call last):
14  File "/Users/rnadhani/Codes/Twisted/twisted-kqueue/twisted/test/test_modules.py", line 270, in test_underUnderPathNotAlreadyImported
15    self._underUnderPathTest(False)
16  File "/Users/rnadhani/Codes/Twisted/twisted-kqueue/twisted/test/test_modules.py", line 254, in _underUnderPathTest
17    importPackages=doImport),
18  File "/Users/rnadhani/Codes/Twisted/twisted-kqueue/twisted/test/test_modules.py", line 37, in findByIteration
19    self.fail("Unable to find module %r through iteration." % (modname,))
20twisted.trial.unittest.FailTest: Unable to find module 'pyspacetests3.foozle' through iteration.
21===============================================================================
22[TODO]: twisted.test.test_modules.RebindingTest.test_underUnderPathNotAlreadyImported
23
24Reason: 'This may be impossible but it sure would be nice.'
25Traceback (most recent call last):
26  File "/Users/rnadhani/Codes/Twisted/twisted-kqueue/twisted/test/test_modules.py", line 270, in test_underUnderPathNotAlreadyImported
27    self._underUnderPathTest(False)
28  File "/Users/rnadhani/Codes/Twisted/twisted-kqueue/twisted/test/test_modules.py", line 254, in _underUnderPathTest
29    importPackages=doImport),
30  File "/Users/rnadhani/Codes/Twisted/twisted-kqueue/twisted/test/test_modules.py", line 37, in findByIteration
31    self.fail("Unable to find module %r through iteration." % (modname,))
32twisted.trial.unittest.FailTest: Unable to find module 'pyspacetests7.foozle' through iteration.
33===============================================================================
34[TODO]: twisted.test.test_modules.ZipPathModificationTest.test_underUnderPathNotAlreadyImported
35
36Reason: 'This may be impossible but it sure would be nice.'
37Traceback (most recent call last):
38  File "/Users/rnadhani/Codes/Twisted/twisted-kqueue/twisted/test/test_modules.py", line 270, in test_underUnderPathNotAlreadyImported
39    self._underUnderPathTest(False)
40  File "/Users/rnadhani/Codes/Twisted/twisted-kqueue/twisted/test/test_modules.py", line 254, in _underUnderPathTest
41    importPackages=doImport),
42  File "/Users/rnadhani/Codes/Twisted/twisted-kqueue/twisted/test/test_modules.py", line 37, in findByIteration
43    self.fail("Unable to find module %r through iteration." % (modname,))
44twisted.trial.unittest.FailTest: Unable to find module 'pyspacetests11.foozle' through iteration.
45===============================================================================
46[FAIL]: twisted.test.test_tcp.HalfCloseBuggyApplicationTests.test_readNotificationRaises
47
48Traceback (most recent call last):
49  File "test_tcp.py", line 1739, in check
50   
51twisted.trial.unittest.FailTest: not equal:
52a = 0
53b = 1
54
55===============================================================================
56[ERROR]: twisted.test.test_iutils.ProcessUtilsTests.test_outputWithErrorIgnored
57
58Traceback (most recent call last):
59Failure: twisted.internet.defer.TimeoutError: <twisted.test.test_iutils.ProcessUtilsTests testMethod=test_outputWithErrorIgnored> (test_outputWithErrorIgnored) still running at 120.0 secs
60===============================================================================
61[ERROR]: twisted.test.test_iutils.ProcessUtilsTests.test_outputWithErrorIgnored
62
63Traceback (most recent call last):
64  File "/Users/rnadhani/Codes/Twisted/twisted-kqueue/twisted/internet/kqreactor.py", line 201, in _doWriteOrRead
65    why = selectable.doRead()
66  File "/Users/rnadhani/Codes/Twisted/twisted-kqueue/twisted/internet/process.py", line 240, in doRead
67    return fdesc.readFromFD(self.fd, self.dataReceived)
68  File "/Users/rnadhani/Codes/Twisted/twisted-kqueue/twisted/internet/fdesc.py", line 94, in readFromFD
69    callback(output)
70  File "/Users/rnadhani/Codes/Twisted/twisted-kqueue/twisted/internet/process.py", line 243, in dataReceived
71    self.proc.childDataReceived(self.name, data)
72  File "/Users/rnadhani/Codes/Twisted/twisted-kqueue/twisted/internet/process.py", line 760, in childDataReceived
73    self.proto.childDataReceived(name, data)
74  File "/Users/rnadhani/Codes/Twisted/twisted-kqueue/twisted/internet/protocol.py", line 548, in childDataReceived
75    self.errReceived(data)
76  File "/Users/rnadhani/Codes/Twisted/twisted-kqueue/twisted/internet/utils.py", line 79, in errReceivedIsBad
77    self.transport.loseConnection()
78  File "/Users/rnadhani/Codes/Twisted/twisted-kqueue/twisted/internet/process.py", line 718, in loseConnection
79    self.closeStdin()
80  File "/Users/rnadhani/Codes/Twisted/twisted-kqueue/twisted/internet/process.py", line 709, in closeStdin
81    self.closeChildFD(0)
82  File "/Users/rnadhani/Codes/Twisted/twisted-kqueue/twisted/internet/process.py", line 692, in closeChildFD
83    self.pipes[childFD].loseConnection()
84  File "/Users/rnadhani/Codes/Twisted/twisted-kqueue/twisted/internet/abstract.py", line 252, in loseConnection
85    self.startWriting()
86  File "/Users/rnadhani/Codes/Twisted/twisted-kqueue/twisted/internet/abstract.py", line 286, in startWriting
87    self.reactor.addWriter(self)
88  File "/Users/rnadhani/Codes/Twisted/twisted-kqueue/twisted/internet/kqreactor.py", line 133, in addWriter
89    self._updateRegistration(fd, select.KQ_FILTER_WRITE, select.KQ_EV_ADD)
90  File "/Users/rnadhani/Codes/Twisted/twisted-kqueue/twisted/internet/kqreactor.py", line 115, in _updateRegistration
91    self._kq.control([select.kevent(*args)], 0, 0)
92exceptions.OSError: [Errno 32] Broken pipe
93===============================================================================
94[ERROR]: twisted.test.test_iutils.ProcessUtilsTests.test_outputWithErrorIgnored
95
96Traceback (most recent call last):
97  File "/Users/rnadhani/Codes/Twisted/twisted-kqueue/twisted/python/log.py", line 84, in callWithLogger
98    return callWithContext({"system": lp}, func, *args, **kw)
99  File "/Users/rnadhani/Codes/Twisted/twisted-kqueue/twisted/python/log.py", line 69, in callWithContext
100    return context.call({ILogContext: newCtx}, func, *args, **kw)
101  File "/Users/rnadhani/Codes/Twisted/twisted-kqueue/twisted/python/context.py", line 59, in callWithContext
102    return self.currentContext().callWithContext(ctx, func, *args, **kw)
103  File "/Users/rnadhani/Codes/Twisted/twisted-kqueue/twisted/python/context.py", line 37, in callWithContext
104    return func(*args,**kw)
105  File "/Users/rnadhani/Codes/Twisted/twisted-kqueue/twisted/internet/kqreactor.py", line 212, in _doWriteOrRead
106    self.removeWriter(selectable)
107  File "/Users/rnadhani/Codes/Twisted/twisted-kqueue/twisted/internet/kqreactor.py", line 153, in removeWriter
108    self._updateRegistration(fd, select.KQ_FILTER_WRITE, select.KQ_EV_DELETE)
109  File "/Users/rnadhani/Codes/Twisted/twisted-kqueue/twisted/internet/kqreactor.py", line 115, in _updateRegistration
110    self._kq.control([select.kevent(*args)], 0, 0)
111exceptions.OSError: [Errno 2] No such file or directory
112===============================================================================
113[ERROR]: twisted.test.test_process.PosixProcessTestCasePTY.testNormalTermination
114
115Traceback (most recent call last):
116  File "/Users/rnadhani/Codes/Twisted/twisted-kqueue/twisted/test/test_process.py", line 1017, in testNormalTermination
117    usePTY=self.usePTY)
118  File "/Users/rnadhani/Codes/Twisted/twisted-kqueue/twisted/internet/posixbase.py", line 319, in spawnProcess
119    processProtocol, uid, gid, usePTY)
120  File "/Users/rnadhani/Codes/Twisted/twisted-kqueue/twisted/internet/process.py", line 835, in __init__
121    self.startReading()
122  File "/Users/rnadhani/Codes/Twisted/twisted-kqueue/twisted/internet/abstract.py", line 278, in startReading
123    self.reactor.addReader(self)
124  File "/Users/rnadhani/Codes/Twisted/twisted-kqueue/twisted/internet/kqreactor.py", line 124, in addReader
125    self._updateRegistration(fd, select.KQ_FILTER_READ, select.KQ_EV_ADD)
126  File "/Users/rnadhani/Codes/Twisted/twisted-kqueue/twisted/internet/kqreactor.py", line 115, in _updateRegistration
127    self._kq.control([select.kevent(*args)], 0, 0)
128exceptions.OSError: [Errno 45] Operation not supported
129===============================================================================
130[ERROR]: twisted.test.test_process.PosixProcessTestCasePTY.testNormalTermination
131
132Traceback (most recent call last):
133  File "/Users/rnadhani/Codes/Twisted/twisted-kqueue/twisted/trial/unittest.py", line 839, in _classCleanUp
134    util._Janitor(self, result).postClassCleanup()
135  File "/Users/rnadhani/Codes/Twisted/twisted-kqueue/twisted/trial/util.py", line 145, in postClassCleanup
136    selectables = self._cleanReactor()
137  File "/Users/rnadhani/Codes/Twisted/twisted-kqueue/twisted/trial/util.py", line 205, in _cleanReactor
138    for sel in reactor.removeAll():
139  File "/Users/rnadhani/Codes/Twisted/twisted-kqueue/twisted/internet/kqreactor.py", line 161, in removeAll
140    [self._selectables[fd] for fd in self._writes])
141  File "/Users/rnadhani/Codes/Twisted/twisted-kqueue/twisted/internet/posixbase.py", line 510, in _removeAll
142    self.removeReader(reader)
143  File "/Users/rnadhani/Codes/Twisted/twisted-kqueue/twisted/internet/kqreactor.py", line 143, in removeReader
144    self._updateRegistration(fd, select.KQ_FILTER_READ, select.KQ_EV_DELETE)
145  File "/Users/rnadhani/Codes/Twisted/twisted-kqueue/twisted/internet/kqreactor.py", line 115, in _updateRegistration
146    self._kq.control([select.kevent(*args)], 0, 0)
147exceptions.OSError: [Errno 2] No such file or directory
148===============================================================================
149[ERROR]: twisted.test.test_process.PosixProcessTestCasePTY.testOpeningTTY
150
151Traceback (most recent call last):
152  File "/Users/rnadhani/Codes/Twisted/twisted-kqueue/twisted/test/test_process.py", line 2024, in testOpeningTTY
153    path=None, usePTY=self.usePTY)
154  File "/Users/rnadhani/Codes/Twisted/twisted-kqueue/twisted/internet/posixbase.py", line 319, in spawnProcess
155    processProtocol, uid, gid, usePTY)
156  File "/Users/rnadhani/Codes/Twisted/twisted-kqueue/twisted/internet/process.py", line 835, in __init__
157    self.startReading()
158  File "/Users/rnadhani/Codes/Twisted/twisted-kqueue/twisted/internet/abstract.py", line 278, in startReading
159    self.reactor.addReader(self)
160  File "/Users/rnadhani/Codes/Twisted/twisted-kqueue/twisted/internet/kqreactor.py", line 124, in addReader
161    self._updateRegistration(fd, select.KQ_FILTER_READ, select.KQ_EV_ADD)
162  File "/Users/rnadhani/Codes/Twisted/twisted-kqueue/twisted/internet/kqreactor.py", line 115, in _updateRegistration
163    self._kq.control([select.kevent(*args)], 0, 0)
164exceptions.OSError: [Errno 45] Operation not supported
165===============================================================================
166[ERROR]: twisted.test.test_process.PosixProcessTestCasePTY.testOpeningTTY
167
168Traceback (most recent call last):
169  File "/Users/rnadhani/Codes/Twisted/twisted-kqueue/twisted/trial/unittest.py", line 839, in _classCleanUp
170    util._Janitor(self, result).postClassCleanup()
171  File "/Users/rnadhani/Codes/Twisted/twisted-kqueue/twisted/trial/util.py", line 145, in postClassCleanup
172    selectables = self._cleanReactor()
173  File "/Users/rnadhani/Codes/Twisted/twisted-kqueue/twisted/trial/util.py", line 205, in _cleanReactor
174    for sel in reactor.removeAll():
175  File "/Users/rnadhani/Codes/Twisted/twisted-kqueue/twisted/internet/kqreactor.py", line 161, in removeAll
176    [self._selectables[fd] for fd in self._writes])
177  File "/Users/rnadhani/Codes/Twisted/twisted-kqueue/twisted/internet/posixbase.py", line 510, in _removeAll
178    self.removeReader(reader)
179  File "/Users/rnadhani/Codes/Twisted/twisted-kqueue/twisted/internet/kqreactor.py", line 143, in removeReader
180    self._updateRegistration(fd, select.KQ_FILTER_READ, select.KQ_EV_DELETE)
181  File "/Users/rnadhani/Codes/Twisted/twisted-kqueue/twisted/internet/kqreactor.py", line 115, in _updateRegistration
182    self._kq.control([select.kevent(*args)], 0, 0)
183exceptions.OSError: [Errno 2] No such file or directory
184===============================================================================
185[ERROR]: twisted.test.test_process.PosixProcessTestCasePTY.test_abnormalTermination
186
187Traceback (most recent call last):
188  File "/Users/rnadhani/Codes/Twisted/twisted-kqueue/twisted/test/test_process.py", line 1037, in test_abnormalTermination
189    env=None, usePTY=self.usePTY)
190  File "/Users/rnadhani/Codes/Twisted/twisted-kqueue/twisted/internet/posixbase.py", line 319, in spawnProcess
191    processProtocol, uid, gid, usePTY)
192  File "/Users/rnadhani/Codes/Twisted/twisted-kqueue/twisted/internet/process.py", line 835, in __init__
193    self.startReading()
194  File "/Users/rnadhani/Codes/Twisted/twisted-kqueue/twisted/internet/abstract.py", line 278, in startReading
195    self.reactor.addReader(self)
196  File "/Users/rnadhani/Codes/Twisted/twisted-kqueue/twisted/internet/kqreactor.py", line 124, in addReader
197    self._updateRegistration(fd, select.KQ_FILTER_READ, select.KQ_EV_ADD)
198  File "/Users/rnadhani/Codes/Twisted/twisted-kqueue/twisted/internet/kqreactor.py", line 115, in _updateRegistration
199    self._kq.control([select.kevent(*args)], 0, 0)
200exceptions.OSError: [Errno 45] Operation not supported
201===============================================================================
202[ERROR]: twisted.test.test_process.PosixProcessTestCasePTY.test_abnormalTermination
203
204Traceback (most recent call last):
205  File "/Users/rnadhani/Codes/Twisted/twisted-kqueue/twisted/trial/unittest.py", line 839, in _classCleanUp
206    util._Janitor(self, result).postClassCleanup()
207  File "/Users/rnadhani/Codes/Twisted/twisted-kqueue/twisted/trial/util.py", line 145, in postClassCleanup
208    selectables = self._cleanReactor()
209  File "/Users/rnadhani/Codes/Twisted/twisted-kqueue/twisted/trial/util.py", line 205, in _cleanReactor
210    for sel in reactor.removeAll():
211  File "/Users/rnadhani/Codes/Twisted/twisted-kqueue/twisted/internet/kqreactor.py", line 161, in removeAll
212    [self._selectables[fd] for fd in self._writes])
213  File "/Users/rnadhani/Codes/Twisted/twisted-kqueue/twisted/internet/posixbase.py", line 510, in _removeAll
214    self.removeReader(reader)
215  File "/Users/rnadhani/Codes/Twisted/twisted-kqueue/twisted/internet/kqreactor.py", line 143, in removeReader
216    self._updateRegistration(fd, select.KQ_FILTER_READ, select.KQ_EV_DELETE)
217  File "/Users/rnadhani/Codes/Twisted/twisted-kqueue/twisted/internet/kqreactor.py", line 115, in _updateRegistration
218    self._kq.control([select.kevent(*args)], 0, 0)
219exceptions.OSError: [Errno 2] No such file or directory
220===============================================================================
221[ERROR]: twisted.test.test_process.PosixProcessTestCasePTY.test_childSignalHandling
222
223Traceback (most recent call last):
224  File "/Users/rnadhani/Codes/Twisted/twisted-kqueue/twisted/test/test_process.py", line 1125, in test_childSignalHandling
225    return self._testSignal(signal.SIGUSR1)
226  File "/Users/rnadhani/Codes/Twisted/twisted-kqueue/twisted/test/test_process.py", line 1053, in _testSignal
227    usePTY=self.usePTY)
228  File "/Users/rnadhani/Codes/Twisted/twisted-kqueue/twisted/internet/posixbase.py", line 319, in spawnProcess
229    processProtocol, uid, gid, usePTY)
230  File "/Users/rnadhani/Codes/Twisted/twisted-kqueue/twisted/internet/process.py", line 835, in __init__
231    self.startReading()
232  File "/Users/rnadhani/Codes/Twisted/twisted-kqueue/twisted/internet/abstract.py", line 278, in startReading
233    self.reactor.addReader(self)
234  File "/Users/rnadhani/Codes/Twisted/twisted-kqueue/twisted/internet/kqreactor.py", line 124, in addReader
235    self._updateRegistration(fd, select.KQ_FILTER_READ, select.KQ_EV_ADD)
236  File "/Users/rnadhani/Codes/Twisted/twisted-kqueue/twisted/internet/kqreactor.py", line 115, in _updateRegistration
237    self._kq.control([select.kevent(*args)], 0, 0)
238exceptions.OSError: [Errno 45] Operation not supported
239===============================================================================
240[ERROR]: twisted.test.test_process.PosixProcessTestCasePTY.test_childSignalHandling
241
242Traceback (most recent call last):
243  File "/Users/rnadhani/Codes/Twisted/twisted-kqueue/twisted/trial/unittest.py", line 839, in _classCleanUp
244    util._Janitor(self, result).postClassCleanup()
245  File "/Users/rnadhani/Codes/Twisted/twisted-kqueue/twisted/trial/util.py", line 145, in postClassCleanup
246    selectables = self._cleanReactor()
247  File "/Users/rnadhani/Codes/Twisted/twisted-kqueue/twisted/trial/util.py", line 205, in _cleanReactor
248    for sel in reactor.removeAll():
249  File "/Users/rnadhani/Codes/Twisted/twisted-kqueue/twisted/internet/kqreactor.py", line 161, in removeAll
250    [self._selectables[fd] for fd in self._writes])
251  File "/Users/rnadhani/Codes/Twisted/twisted-kqueue/twisted/internet/posixbase.py", line 510, in _removeAll
252    self.removeReader(reader)
253  File "/Users/rnadhani/Codes/Twisted/twisted-kqueue/twisted/internet/kqreactor.py", line 143, in removeReader
254    self._updateRegistration(fd, select.KQ_FILTER_READ, select.KQ_EV_DELETE)
255  File "/Users/rnadhani/Codes/Twisted/twisted-kqueue/twisted/internet/kqreactor.py", line 115, in _updateRegistration
256    self._kq.control([select.kevent(*args)], 0, 0)
257exceptions.OSError: [Errno 2] No such file or directory
258===============================================================================
259[ERROR]: twisted.test.test_process.PosixProcessTestCasePTY.test_executionError
260
261Traceback (most recent call last):
262  File "/Users/rnadhani/Codes/Twisted/twisted-kqueue/twisted/test/test_process.py", line 1142, in test_executionError
263    usePTY=self.usePTY)
264  File "/Users/rnadhani/Codes/Twisted/twisted-kqueue/twisted/internet/posixbase.py", line 319, in spawnProcess
265    processProtocol, uid, gid, usePTY)
266  File "/Users/rnadhani/Codes/Twisted/twisted-kqueue/twisted/internet/process.py", line 835, in __init__
267    self.startReading()
268  File "/Users/rnadhani/Codes/Twisted/twisted-kqueue/twisted/internet/abstract.py", line 278, in startReading
269    self.reactor.addReader(self)
270  File "/Users/rnadhani/Codes/Twisted/twisted-kqueue/twisted/internet/kqreactor.py", line 124, in addReader
271    self._updateRegistration(fd, select.KQ_FILTER_READ, select.KQ_EV_ADD)
272  File "/Users/rnadhani/Codes/Twisted/twisted-kqueue/twisted/internet/kqreactor.py", line 115, in _updateRegistration
273    self._kq.control([select.kevent(*args)], 0, 0)
274exceptions.OSError: [Errno 45] Operation not supported
275===============================================================================
276[ERROR]: twisted.test.test_process.PosixProcessTestCasePTY.test_executionError
277
278Traceback (most recent call last):
279  File "/Users/rnadhani/Codes/Twisted/twisted-kqueue/twisted/trial/unittest.py", line 839, in _classCleanUp
280    util._Janitor(self, result).postClassCleanup()
281  File "/Users/rnadhani/Codes/Twisted/twisted-kqueue/twisted/trial/util.py", line 145, in postClassCleanup
282    selectables = self._cleanReactor()
283  File "/Users/rnadhani/Codes/Twisted/twisted-kqueue/twisted/trial/util.py", line 205, in _cleanReactor
284    for sel in reactor.removeAll():
285  File "/Users/rnadhani/Codes/Twisted/twisted-kqueue/twisted/internet/kqreactor.py", line 161, in removeAll
286    [self._selectables[fd] for fd in self._writes])
287  File "/Users/rnadhani/Codes/Twisted/twisted-kqueue/twisted/internet/posixbase.py", line 510, in _removeAll
288    self.removeReader(reader)
289  File "/Users/rnadhani/Codes/Twisted/twisted-kqueue/twisted/internet/kqreactor.py", line 143, in removeReader
290    self._updateRegistration(fd, select.KQ_FILTER_READ, select.KQ_EV_DELETE)
291  File "/Users/rnadhani/Codes/Twisted/twisted-kqueue/twisted/internet/kqreactor.py", line 115, in _updateRegistration
292    self._kq.control([select.kevent(*args)], 0, 0)
293exceptions.OSError: [Errno 2] No such file or directory
294===============================================================================
295[ERROR]: twisted.test.test_process.PosixProcessTestCasePTY.test_signalHUP
296
297Traceback (most recent call last):
298  File "/Users/rnadhani/Codes/Twisted/twisted-kqueue/twisted/test/test_process.py", line 1065, in test_signalHUP
299    return self._testSignal('HUP')
300  File "/Users/rnadhani/Codes/Twisted/twisted-kqueue/twisted/test/test_process.py", line 1053, in _testSignal
301    usePTY=self.usePTY)
302  File "/Users/rnadhani/Codes/Twisted/twisted-kqueue/twisted/internet/posixbase.py", line 319, in spawnProcess
303    processProtocol, uid, gid, usePTY)
304  File "/Users/rnadhani/Codes/Twisted/twisted-kqueue/twisted/internet/process.py", line 835, in __init__
305    self.startReading()
306  File "/Users/rnadhani/Codes/Twisted/twisted-kqueue/twisted/internet/abstract.py", line 278, in startReading
307    self.reactor.addReader(self)
308  File "/Users/rnadhani/Codes/Twisted/twisted-kqueue/twisted/internet/kqreactor.py", line 124, in addReader
309    self._updateRegistration(fd, select.KQ_FILTER_READ, select.KQ_EV_ADD)
310  File "/Users/rnadhani/Codes/Twisted/twisted-kqueue/twisted/internet/kqreactor.py", line 115, in _updateRegistration
311    self._kq.control([select.kevent(*args)], 0, 0)
312exceptions.OSError: [Errno 45] Operation not supported
313===============================================================================
314[ERROR]: twisted.test.test_process.PosixProcessTestCasePTY.test_signalHUP
315
316Traceback (most recent call last):
317  File "/Users/rnadhani/Codes/Twisted/twisted-kqueue/twisted/trial/unittest.py", line 839, in _classCleanUp
318    util._Janitor(self, result).postClassCleanup()
319  File "/Users/rnadhani/Codes/Twisted/twisted-kqueue/twisted/trial/util.py", line 145, in postClassCleanup
320    selectables = self._cleanReactor()
321  File "/Users/rnadhani/Codes/Twisted/twisted-kqueue/twisted/trial/util.py", line 205, in _cleanReactor
322    for sel in reactor.removeAll():
323  File "/Users/rnadhani/Codes/Twisted/twisted-kqueue/twisted/internet/kqreactor.py", line 161, in removeAll
324    [self._selectables[fd] for fd in self._writes])
325  File "/Users/rnadhani/Codes/Twisted/twisted-kqueue/twisted/internet/posixbase.py", line 510, in _removeAll
326    self.removeReader(reader)
327  File "/Users/rnadhani/Codes/Twisted/twisted-kqueue/twisted/internet/kqreactor.py", line 143, in removeReader
328    self._updateRegistration(fd, select.KQ_FILTER_READ, select.KQ_EV_DELETE)
329  File "/Users/rnadhani/Codes/Twisted/twisted-kqueue/twisted/internet/kqreactor.py", line 115, in _updateRegistration
330    self._kq.control([select.kevent(*args)], 0, 0)
331exceptions.OSError: [Errno 2] No such file or directory
332===============================================================================
333[ERROR]: twisted.test.test_process.PosixProcessTestCasePTY.test_signalINT
334
335Traceback (most recent call last):
336  File "/Users/rnadhani/Codes/Twisted/twisted-kqueue/twisted/test/test_process.py", line 1076, in test_signalINT
337    return self._testSignal('INT')
338  File "/Users/rnadhani/Codes/Twisted/twisted-kqueue/twisted/test/test_process.py", line 1053, in _testSignal
339    usePTY=self.usePTY)
340  File "/Users/rnadhani/Codes/Twisted/twisted-kqueue/twisted/internet/posixbase.py", line 319, in spawnProcess
341    processProtocol, uid, gid, usePTY)
342  File "/Users/rnadhani/Codes/Twisted/twisted-kqueue/twisted/internet/process.py", line 835, in __init__
343    self.startReading()
344  File "/Users/rnadhani/Codes/Twisted/twisted-kqueue/twisted/internet/abstract.py", line 278, in startReading
345    self.reactor.addReader(self)
346  File "/Users/rnadhani/Codes/Twisted/twisted-kqueue/twisted/internet/kqreactor.py", line 124, in addReader
347    self._updateRegistration(fd, select.KQ_FILTER_READ, select.KQ_EV_ADD)
348  File "/Users/rnadhani/Codes/Twisted/twisted-kqueue/twisted/internet/kqreactor.py", line 115, in _updateRegistration
349    self._kq.control([select.kevent(*args)], 0, 0)
350exceptions.OSError: [Errno 45] Operation not supported
351===============================================================================
352[ERROR]: twisted.test.test_process.PosixProcessTestCasePTY.test_signalINT
353
354Traceback (most recent call last):
355  File "/Users/rnadhani/Codes/Twisted/twisted-kqueue/twisted/trial/unittest.py", line 839, in _classCleanUp
356    util._Janitor(self, result).postClassCleanup()
357  File "/Users/rnadhani/Codes/Twisted/twisted-kqueue/twisted/trial/util.py", line 145, in postClassCleanup
358    selectables = self._cleanReactor()
359  File "/Users/rnadhani/Codes/Twisted/twisted-kqueue/twisted/trial/util.py", line 205, in _cleanReactor
360    for sel in reactor.removeAll():
361  File "/Users/rnadhani/Codes/Twisted/twisted-kqueue/twisted/internet/kqreactor.py", line 161, in removeAll
362    [self._selectables[fd] for fd in self._writes])
363  File "/Users/rnadhani/Codes/Twisted/twisted-kqueue/twisted/internet/posixbase.py", line 510, in _removeAll
364    self.removeReader(reader)
365  File "/Users/rnadhani/Codes/Twisted/twisted-kqueue/twisted/internet/kqreactor.py", line 143, in removeReader
366    self._updateRegistration(fd, select.KQ_FILTER_READ, select.KQ_EV_DELETE)
367  File "/Users/rnadhani/Codes/Twisted/twisted-kqueue/twisted/internet/kqreactor.py", line 115, in _updateRegistration
368    self._kq.control([select.kevent(*args)], 0, 0)
369exceptions.OSError: [Errno 2] No such file or directory
370===============================================================================
371[ERROR]: twisted.test.test_process.PosixProcessTestCasePTY.test_signalKILL
372
373Traceback (most recent call last):
374  File "/Users/rnadhani/Codes/Twisted/twisted-kqueue/twisted/test/test_process.py", line 1087, in test_signalKILL
375    return self._testSignal('KILL')
376  File "/Users/rnadhani/Codes/Twisted/twisted-kqueue/twisted/test/test_process.py", line 1053, in _testSignal
377    usePTY=self.usePTY)
378  File "/Users/rnadhani/Codes/Twisted/twisted-kqueue/twisted/internet/posixbase.py", line 319, in spawnProcess
379    processProtocol, uid, gid, usePTY)
380  File "/Users/rnadhani/Codes/Twisted/twisted-kqueue/twisted/internet/process.py", line 835, in __init__
381    self.startReading()
382  File "/Users/rnadhani/Codes/Twisted/twisted-kqueue/twisted/internet/abstract.py", line 278, in startReading
383    self.reactor.addReader(self)
384  File "/Users/rnadhani/Codes/Twisted/twisted-kqueue/twisted/internet/kqreactor.py", line 124, in addReader
385    self._updateRegistration(fd, select.KQ_FILTER_READ, select.KQ_EV_ADD)
386  File "/Users/rnadhani/Codes/Twisted/twisted-kqueue/twisted/internet/kqreactor.py", line 115, in _updateRegistration
387    self._kq.control([select.kevent(*args)], 0, 0)
388exceptions.OSError: [Errno 45] Operation not supported
389===============================================================================
390[ERROR]: twisted.test.test_process.PosixProcessTestCasePTY.test_signalKILL
391
392Traceback (most recent call last):
393  File "/Users/rnadhani/Codes/Twisted/twisted-kqueue/twisted/trial/unittest.py", line 839, in _classCleanUp
394    util._Janitor(self, result).postClassCleanup()
395  File "/Users/rnadhani/Codes/Twisted/twisted-kqueue/twisted/trial/util.py", line 145, in postClassCleanup
396    selectables = self._cleanReactor()
397  File "/Users/rnadhani/Codes/Twisted/twisted-kqueue/twisted/trial/util.py", line 205, in _cleanReactor
398    for sel in reactor.removeAll():
399  File "/Users/rnadhani/Codes/Twisted/twisted-kqueue/twisted/internet/kqreactor.py", line 161, in removeAll
400    [self._selectables[fd] for fd in self._writes])
401  File "/Users/rnadhani/Codes/Twisted/twisted-kqueue/twisted/internet/posixbase.py", line 510, in _removeAll
402    self.removeReader(reader)
403  File "/Users/rnadhani/Codes/Twisted/twisted-kqueue/twisted/internet/kqreactor.py", line 143, in removeReader
404    self._updateRegistration(fd, select.KQ_FILTER_READ, select.KQ_EV_DELETE)
405  File "/Users/rnadhani/Codes/Twisted/twisted-kqueue/twisted/internet/kqreactor.py", line 115, in _updateRegistration
406    self._kq.control([select.kevent(*args)], 0, 0)
407exceptions.OSError: [Errno 2] No such file or directory
408===============================================================================
409[ERROR]: twisted.test.test_process.PosixProcessTestCasePTY.test_signalTERM
410
411Traceback (most recent call last):
412  File "/Users/rnadhani/Codes/Twisted/twisted-kqueue/twisted/test/test_process.py", line 1098, in test_signalTERM
413    return self._testSignal('TERM')
414  File "/Users/rnadhani/Codes/Twisted/twisted-kqueue/twisted/test/test_process.py", line 1053, in _testSignal
415    usePTY=self.usePTY)
416  File "/Users/rnadhani/Codes/Twisted/twisted-kqueue/twisted/internet/posixbase.py", line 319, in spawnProcess
417    processProtocol, uid, gid, usePTY)
418  File "/Users/rnadhani/Codes/Twisted/twisted-kqueue/twisted/internet/process.py", line 835, in __init__
419    self.startReading()
420  File "/Users/rnadhani/Codes/Twisted/twisted-kqueue/twisted/internet/abstract.py", line 278, in startReading
421    self.reactor.addReader(self)
422  File "/Users/rnadhani/Codes/Twisted/twisted-kqueue/twisted/internet/kqreactor.py", line 124, in addReader
423    self._updateRegistration(fd, select.KQ_FILTER_READ, select.KQ_EV_ADD)
424  File "/Users/rnadhani/Codes/Twisted/twisted-kqueue/twisted/internet/kqreactor.py", line 115, in _updateRegistration
425    self._kq.control([select.kevent(*args)], 0, 0)
426exceptions.OSError: [Errno 45] Operation not supported
427===============================================================================
428[ERROR]: twisted.test.test_process.PosixProcessTestCasePTY.test_signalTERM
429
430Traceback (most recent call last):
431  File "/Users/rnadhani/Codes/Twisted/twisted-kqueue/twisted/trial/unittest.py", line 839, in _classCleanUp
432    util._Janitor(self, result).postClassCleanup()
433  File "/Users/rnadhani/Codes/Twisted/twisted-kqueue/twisted/trial/util.py", line 145, in postClassCleanup
434    selectables = self._cleanReactor()
435  File "/Users/rnadhani/Codes/Twisted/twisted-kqueue/twisted/trial/util.py", line 205, in _cleanReactor
436    for sel in reactor.removeAll():
437  File "/Users/rnadhani/Codes/Twisted/twisted-kqueue/twisted/internet/kqreactor.py", line 161, in removeAll
438    [self._selectables[fd] for fd in self._writes])
439  File "/Users/rnadhani/Codes/Twisted/twisted-kqueue/twisted/internet/posixbase.py", line 510, in _removeAll
440    self.removeReader(reader)
441  File "/Users/rnadhani/Codes/Twisted/twisted-kqueue/twisted/internet/kqreactor.py", line 143, in removeReader
442    self._updateRegistration(fd, select.KQ_FILTER_READ, select.KQ_EV_DELETE)
443  File "/Users/rnadhani/Codes/Twisted/twisted-kqueue/twisted/internet/kqreactor.py", line 115, in _updateRegistration
444    self._kq.control([select.kevent(*args)], 0, 0)
445exceptions.OSError: [Errno 2] No such file or directory
446===============================================================================
447[ERROR]: twisted.test.test_process.TestTwoProcessesPosix.testClosePty
448
449Traceback (most recent call last):
450  File "/Users/rnadhani/Codes/Twisted/twisted-kqueue/twisted/test/test_process.py", line 836, in testClosePty
451    self.createProcesses(usePTY=1)
452  File "/Users/rnadhani/Codes/Twisted/twisted-kqueue/twisted/test/test_process.py", line 783, in createProcesses
453    usePTY=usePTY)
454  File "/Users/rnadhani/Codes/Twisted/twisted-kqueue/twisted/internet/posixbase.py", line 319, in spawnProcess
455    processProtocol, uid, gid, usePTY)
456  File "/Users/rnadhani/Codes/Twisted/twisted-kqueue/twisted/internet/process.py", line 835, in __init__
457    self.startReading()
458  File "/Users/rnadhani/Codes/Twisted/twisted-kqueue/twisted/internet/abstract.py", line 278, in startReading
459    self.reactor.addReader(self)
460  File "/Users/rnadhani/Codes/Twisted/twisted-kqueue/twisted/internet/kqreactor.py", line 124, in addReader
461    self._updateRegistration(fd, select.KQ_FILTER_READ, select.KQ_EV_ADD)
462  File "/Users/rnadhani/Codes/Twisted/twisted-kqueue/twisted/internet/kqreactor.py", line 115, in _updateRegistration
463    self._kq.control([select.kevent(*args)], 0, 0)
464exceptions.OSError: [Errno 45] Operation not supported
465===============================================================================
466[ERROR]: twisted.test.test_process.TestTwoProcessesPosix.testClosePty
467
468Traceback (most recent call last):
469  File "/Users/rnadhani/Codes/Twisted/twisted-kqueue/twisted/test/test_process.py", line 812, in tearDown
470    os.kill(pr.pid, signal.SIGTERM)
471exceptions.AttributeError: 'NoneType' object has no attribute 'pid'
472===============================================================================
473[ERROR]: twisted.test.test_process.TestTwoProcessesPosix.testClosePty
474
475Traceback (most recent call last):
476  File "/Users/rnadhani/Codes/Twisted/twisted-kqueue/twisted/trial/unittest.py", line 839, in _classCleanUp
477    util._Janitor(self, result).postClassCleanup()
478  File "/Users/rnadhani/Codes/Twisted/twisted-kqueue/twisted/trial/util.py", line 145, in postClassCleanup
479    selectables = self._cleanReactor()
480  File "/Users/rnadhani/Codes/Twisted/twisted-kqueue/twisted/trial/util.py", line 205, in _cleanReactor
481    for sel in reactor.removeAll():
482  File "/Users/rnadhani/Codes/Twisted/twisted-kqueue/twisted/internet/kqreactor.py", line 161, in removeAll
483    [self._selectables[fd] for fd in self._writes])
484  File "/Users/rnadhani/Codes/Twisted/twisted-kqueue/twisted/internet/posixbase.py", line 510, in _removeAll
485    self.removeReader(reader)
486  File "/Users/rnadhani/Codes/Twisted/twisted-kqueue/twisted/internet/kqreactor.py", line 143, in removeReader
487    self._updateRegistration(fd, select.KQ_FILTER_READ, select.KQ_EV_DELETE)
488  File "/Users/rnadhani/Codes/Twisted/twisted-kqueue/twisted/internet/kqreactor.py", line 115, in _updateRegistration
489    self._kq.control([select.kevent(*args)], 0, 0)
490exceptions.OSError: [Errno 2] No such file or directory
491===============================================================================
492[ERROR]: twisted.test.test_process.TestTwoProcessesPosix.testKillPty
493
494Traceback (most recent call last):
495  File "/Users/rnadhani/Codes/Twisted/twisted-kqueue/twisted/test/test_process.py", line 843, in testKillPty
496    self.createProcesses(usePTY=1)
497  File "/Users/rnadhani/Codes/Twisted/twisted-kqueue/twisted/test/test_process.py", line 783, in createProcesses
498    usePTY=usePTY)
499  File "/Users/rnadhani/Codes/Twisted/twisted-kqueue/twisted/internet/posixbase.py", line 319, in spawnProcess
500    processProtocol, uid, gid, usePTY)
501  File "/Users/rnadhani/Codes/Twisted/twisted-kqueue/twisted/internet/process.py", line 835, in __init__
502    self.startReading()
503  File "/Users/rnadhani/Codes/Twisted/twisted-kqueue/twisted/internet/abstract.py", line 278, in startReading
504    self.reactor.addReader(self)
505  File "/Users/rnadhani/Codes/Twisted/twisted-kqueue/twisted/internet/kqreactor.py", line 124, in addReader
506    self._updateRegistration(fd, select.KQ_FILTER_READ, select.KQ_EV_ADD)
507  File "/Users/rnadhani/Codes/Twisted/twisted-kqueue/twisted/internet/kqreactor.py", line 115, in _updateRegistration
508    self._kq.control([select.kevent(*args)], 0, 0)
509exceptions.OSError: [Errno 45] Operation not supported
510===============================================================================
511[ERROR]: twisted.test.test_process.TestTwoProcessesPosix.testKillPty
512
513Traceback (most recent call last):
514  File "/Users/rnadhani/Codes/Twisted/twisted-kqueue/twisted/test/test_process.py", line 812, in tearDown
515    os.kill(pr.pid, signal.SIGTERM)
516exceptions.AttributeError: 'NoneType' object has no attribute 'pid'
517===============================================================================
518[ERROR]: twisted.test.test_process.TestTwoProcessesPosix.testKillPty
519
520Traceback (most recent call last):
521  File "/Users/rnadhani/Codes/Twisted/twisted-kqueue/twisted/trial/unittest.py", line 839, in _classCleanUp
522    util._Janitor(self, result).postClassCleanup()
523  File "/Users/rnadhani/Codes/Twisted/twisted-kqueue/twisted/trial/util.py", line 145, in postClassCleanup
524    selectables = self._cleanReactor()
525  File "/Users/rnadhani/Codes/Twisted/twisted-kqueue/twisted/trial/util.py", line 205, in _cleanReactor
526    for sel in reactor.removeAll():
527  File "/Users/rnadhani/Codes/Twisted/twisted-kqueue/twisted/internet/kqreactor.py", line 161, in removeAll
528    [self._selectables[fd] for fd in self._writes])
529  File "/Users/rnadhani/Codes/Twisted/twisted-kqueue/twisted/internet/posixbase.py", line 510, in _removeAll
530    self.removeReader(reader)
531  File "/Users/rnadhani/Codes/Twisted/twisted-kqueue/twisted/internet/kqreactor.py", line 143, in removeReader
532    self._updateRegistration(fd, select.KQ_FILTER_READ, select.KQ_EV_DELETE)
533  File "/Users/rnadhani/Codes/Twisted/twisted-kqueue/twisted/internet/kqreactor.py", line 115, in _updateRegistration
534    self._kq.control([select.kevent(*args)], 0, 0)
535exceptions.OSError: [Errno 2] No such file or directory
536===============================================================================
537[ERROR]: twisted.test.test_stdio.StandardInputOutputTestCase.test_consumer
538
539Traceback (most recent call last):
540  File "/Users/rnadhani/Codes/Twisted/twisted-kqueue/twisted/test/test_stdio.py", line 122, in eb
541    return callback(err)
542  File "/Users/rnadhani/Codes/Twisted/twisted-kqueue/twisted/test/test_stdio.py", line 311, in processEnded
543    self.assertEquals(p.data[1], file(junkPath).read())
544exceptions.KeyError: 1
545===============================================================================
546[ERROR]: twisted.test.test_stdio.StandardInputOutputTestCase.test_hostAndPeer
547
548Traceback (most recent call last):
549  File "/Users/rnadhani/Codes/Twisted/twisted-kqueue/twisted/test/test_stdio.py", line 122, in eb
550    return callback(err)
551  File "/Users/rnadhani/Codes/Twisted/twisted-kqueue/twisted/test/test_stdio.py", line 222, in processEnded
552    host, peer = p.data[1].splitlines()
553exceptions.KeyError: 1
554===============================================================================
555[ERROR]: twisted.test.test_stdio.StandardInputOutputTestCase.test_lastWriteReceived
556
557Traceback (most recent call last):
558  File "/Users/rnadhani/Codes/Twisted/twisted-kqueue/twisted/test/test_stdio.py", line 194, in test_lastWriteReceived
559    usePTY=True)
560  File "/Users/rnadhani/Codes/Twisted/twisted-kqueue/twisted/test/test_stdio.py", line 115, in _spawnProcess
561    **kw)
562  File "/Users/rnadhani/Codes/Twisted/twisted-kqueue/twisted/internet/posixbase.py", line 319, in spawnProcess
563    processProtocol, uid, gid, usePTY)
564  File "/Users/rnadhani/Codes/Twisted/twisted-kqueue/twisted/internet/process.py", line 835, in __init__
565    self.startReading()
566  File "/Users/rnadhani/Codes/Twisted/twisted-kqueue/twisted/internet/abstract.py", line 278, in startReading
567    self.reactor.addReader(self)
568  File "/Users/rnadhani/Codes/Twisted/twisted-kqueue/twisted/internet/kqreactor.py", line 124, in addReader
569    self._updateRegistration(fd, select.KQ_FILTER_READ, select.KQ_EV_ADD)
570  File "/Users/rnadhani/Codes/Twisted/twisted-kqueue/twisted/internet/kqreactor.py", line 115, in _updateRegistration
571    self._kq.control([select.kevent(*args)], 0, 0)
572exceptions.OSError: [Errno 45] Operation not supported
573===============================================================================
574[ERROR]: twisted.test.test_stdio.StandardInputOutputTestCase.test_lastWriteReceived
575
576Traceback (most recent call last):
577  File "/Users/rnadhani/Codes/Twisted/twisted-kqueue/twisted/trial/unittest.py", line 839, in _classCleanUp
578    util._Janitor(self, result).postClassCleanup()
579  File "/Users/rnadhani/Codes/Twisted/twisted-kqueue/twisted/trial/util.py", line 145, in postClassCleanup
580    selectables = self._cleanReactor()
581  File "/Users/rnadhani/Codes/Twisted/twisted-kqueue/twisted/trial/util.py", line 205, in _cleanReactor
582    for sel in reactor.removeAll():
583  File "/Users/rnadhani/Codes/Twisted/twisted-kqueue/twisted/internet/kqreactor.py", line 161, in removeAll
584    [self._selectables[fd] for fd in self._writes])
585  File "/Users/rnadhani/Codes/Twisted/twisted-kqueue/twisted/internet/posixbase.py", line 510, in _removeAll
586    self.removeReader(reader)
587  File "/Users/rnadhani/Codes/Twisted/twisted-kqueue/twisted/internet/kqreactor.py", line 143, in removeReader
588    self._updateRegistration(fd, select.KQ_FILTER_READ, select.KQ_EV_DELETE)
589  File "/Users/rnadhani/Codes/Twisted/twisted-kqueue/twisted/internet/kqreactor.py", line 115, in _updateRegistration
590    self._kq.control([select.kevent(*args)], 0, 0)
591exceptions.OSError: [Errno 2] No such file or directory
592===============================================================================
593[ERROR]: twisted.test.test_stdio.StandardInputOutputTestCase.test_loseConnection
594
595Traceback (most recent call last):
596  File "/Users/rnadhani/Codes/Twisted/twisted-kqueue/twisted/test/test_stdio.py", line 122, in eb
597    return callback(err)
598  File "/Users/rnadhani/Codes/Twisted/twisted-kqueue/twisted/test/test_stdio.py", line 139, in processEnded
599    for line in file(errorLogFile):
600exceptions.IOError: [Errno 2] No such file or directory: 'twisted.test.test_stdio/StandardInputOutputTestCase/test_loseConnection/cUPM2H/temp'
601===============================================================================
602[ERROR]: twisted.test.test_stdio.StandardInputOutputTestCase.test_producer
603
604Traceback (most recent call last):
605  File "/Users/rnadhani/Codes/Twisted/twisted-kqueue/twisted/test/test_stdio.py", line 122, in eb
606    return callback(err)
607  File "/Users/rnadhani/Codes/Twisted/twisted-kqueue/twisted/test/test_stdio.py", line 292, in processEnded
608    self.assertEquals(p.data[1], ''.join(written))
609exceptions.KeyError: 1
610===============================================================================
611[ERROR]: twisted.test.test_stdio.StandardInputOutputTestCase.test_producer
612
613Traceback (most recent call last):
614Failure: twisted.trial.util.DirtyReactorAggregateError: Reactor was unclean.
615DelayedCalls: (set twisted.internet.base.DelayedCall.debug = True to debug)
616<DelayedCall 0x1d85760 [0.00967001914978s] called=0 cancelled=0 connectionMade(None)>
617===============================================================================
618[ERROR]: twisted.test.test_stdio.StandardInputOutputTestCase.test_readConnectionLost
619
620Traceback (most recent call last):
621Failure: twisted.internet.error.ProcessTerminated: A process has ended with a probable error condition: process ended with exit code 1.
622===============================================================================
623[ERROR]: twisted.test.test_stdio.StandardInputOutputTestCase.test_write
624
625Traceback (most recent call last):
626  File "/Users/rnadhani/Codes/Twisted/twisted-kqueue/twisted/test/test_stdio.py", line 122, in eb
627    return callback(err)
628  File "/Users/rnadhani/Codes/Twisted/twisted-kqueue/twisted/test/test_stdio.py", line 240, in processEnded
629    self.assertEquals(p.data[1], 'ok!')
630exceptions.KeyError: 1
631===============================================================================
632[ERROR]: twisted.test.test_stdio.StandardInputOutputTestCase.test_writeSequence
633
634Traceback (most recent call last):
635  File "/Users/rnadhani/Codes/Twisted/twisted-kqueue/twisted/test/test_stdio.py", line 122, in eb
636    return callback(err)
637  File "/Users/rnadhani/Codes/Twisted/twisted-kqueue/twisted/test/test_stdio.py", line 256, in processEnded
638    self.assertEquals(p.data[1], 'ok!')
639exceptions.KeyError: 1
640===============================================================================
641[ERROR]: twisted.test.test_tcp.HalfCloseTestCase.testCloseWriteCloser
642
643Traceback (most recent call last):
644Failure: twisted.internet.defer.TimeoutError: <twisted.test.test_tcp.HalfCloseTestCase testMethod=testCloseWriteCloser> (testCloseWriteCloser) still running at 120.0 secs
645===============================================================================
646[ERROR]: twisted.test.test_tcp.HalfCloseTestCase.testCloseWriteCloser
647
648Traceback (most recent call last):
649Failure: twisted.trial.util.DirtyReactorAggregateError: Reactor was unclean.
650DelayedCalls: (set twisted.internet.base.DelayedCall.debug = True to debug)
651<DelayedCall 0x2937b70 [-8.08238983154e-05s] called=0 cancelled=0 LoopingCall<0>(check, *(), **{})()>
652===============================================================================
653[ERROR]: twisted.test.test_tcp.HalfCloseTestCase.testCloseWriteCloser
654
655Traceback (most recent call last):
656Failure: twisted.trial.util.DirtyReactorAggregateError: Reactor was unclean.
657Selectables:
658<<class 'twisted.internet.tcp.Port'> of twisted.test.test_tcp.MyHCFactory on 60298>
659===============================================================================
660[ERROR]: twisted.test.test_tcp.HalfCloseTestCase.testWriteCloseNotification
661
662Traceback (most recent call last):
663Failure: twisted.internet.defer.TimeoutError: <twisted.test.test_tcp.HalfCloseTestCase testMethod=testWriteCloseNotification> (testWriteCloseNotification) still running at 120.0 secs
664===============================================================================
665[ERROR]: twisted.test.test_tcp.HalfCloseTestCase.testWriteCloseNotification
666
667Traceback (most recent call last):
668  File "test_tcp.py", line 1583, in tearDown
669   
670twisted.trial.unittest.FailTest: not equal:
671a = 1
672b = 0
673
674===============================================================================
675[ERROR]: twisted.test.test_tcp.HalfCloseTestCase.testWriteCloseNotification
676
677Traceback (most recent call last):
678Failure: twisted.trial.util.DirtyReactorAggregateError: Reactor was unclean.
679DelayedCalls: (set twisted.internet.base.DelayedCall.debug = True to debug)
680<DelayedCall 0x296a9e0 [-0.000108003616333s] called=0 cancelled=0 LoopingCall<0>(check, *(), **{})()>
681-------------------------------------------------------------------------------
682Ran 1857 tests in 410.160s
683
684FAILED (skips=59, expectedFailures=4, failures=1, errors=43, successes=1771)