Ticket #1918: select_vs_new_kqueue_diff.log

File select_vs_new_kqueue_diff.log, 6.3 KB (added by oberstet, 2 years ago)

diff select.log new_kqueue.log > select_vs_new_kqueue_diff.log

Line 
15321c5321
2<     test_readNotificationRaises ...                                        [OK]
3---
4>     test_readNotificationRaises ...                                      [FAIL]
55324,5325c5324,5329
6<     testCloseWriteCloser ...                                               [OK]
7<     testWriteCloseNotification ...                                         [OK]
8---
9>     testCloseWriteCloser ...                                            [ERROR]
10>                                            [ERROR]
11>                                            [ERROR]
12>     testWriteCloseNotification ...                                      [ERROR]
13>                                      [ERROR]
14>                                      [ERROR]
156066c6070
16<     test_coverdirOverridden ... Setting coverage directory to /usr/home/autobahn/Autobahn/testsuite/websockets/_trial_temp/twisted.trial.test.test_script/CoverageTests/test_coverdirOverridden/Mgc5dX/temp/coverage.
17---
18>     test_coverdirOverridden ... Setting coverage directory to /usr/home/autobahn/Autobahn/testsuite/websockets/_trial_temp/twisted.trial.test.test_script/CoverageTests/test_coverdirOverridden/onF_uC/temp/coverage.
198824c8828
20< <twisted.internet.pollreactor.PollReactor object at 0x292afcac> does not provide <InterfaceClass twisted.internet.interfaces.IReactorWin32Events>
21---
22> <twisted.internet.pollreactor.PollReactor object at 0x292b4bcc> does not provide <InterfaceClass twisted.internet.interfaces.IReactorWin32Events>
238829c8833
24< <twisted.internet.pollreactor.PollReactor object at 0x2bc8848c> does not provide <InterfaceClass twisted.internet.interfaces.IReactorWin32Events>
25---
26> <twisted.internet.pollreactor.PollReactor object at 0x2b961e4c> does not provide <InterfaceClass twisted.internet.interfaces.IReactorWin32Events>
278834c8838
28< <twisted.internet.selectreactor.SelectReactor object at 0x2bc7c4ac> does not provide <InterfaceClass twisted.internet.interfaces.IReactorWin32Events>
29---
30> <twisted.internet.selectreactor.SelectReactor object at 0x2b97448c> does not provide <InterfaceClass twisted.internet.interfaces.IReactorWin32Events>
318839c8843
32< <twisted.internet.selectreactor.SelectReactor object at 0x2b547b4c> does not provide <InterfaceClass twisted.internet.interfaces.IReactorWin32Events>
33---
34> <twisted.internet.selectreactor.SelectReactor object at 0x2b957e6c> does not provide <InterfaceClass twisted.internet.interfaces.IReactorWin32Events>
359232c9236
36< twisted.trial.unittest.FailTest: 57 in xrange(256)
37---
38> twisted.trial.unittest.FailTest: 58 in xrange(256)
399235a9240,9250
40> [FAIL]
41> Traceback (most recent call last):
42>   File "/home/autobahn/python/lib/python2.7/site-packages/Twisted-11.0.0-py2.7-freebsd-8.2-RELEASE-p3-i386.egg/twisted/test/test_tcp.py", line 1758, in check
43>     self.assertEqual(len(errors), 1)
44> twisted.trial.unittest.FailTest: not equal:
45> a = 0
46> b = 1
47>
48>
49> twisted.test.test_tcp.HalfCloseBuggyApplicationTests.test_readNotificationRaises
50> ===============================================================================
519262c9277
52< exceptions.ValueError: an adapter (<function <lambda> at 0x2c0dc41c>) was already registered.
53---
54> exceptions.ValueError: an adapter (<function <lambda> at 0x2bbd1374>) was already registered.
559274c9289
56< exceptions.ValueError: an adapter (<function <lambda> at 0x2c0dc41c>) was already registered.
57---
58> exceptions.ValueError: an adapter (<function <lambda> at 0x2bbd1374>) was already registered.
599286c9301
60< exceptions.ValueError: an adapter (<function <lambda> at 0x2c0dc41c>) was already registered.
61---
62> exceptions.ValueError: an adapter (<function <lambda> at 0x2bbd1374>) was already registered.
639288a9304,9350
64> ===============================================================================
65> [ERROR]
66> Traceback (most recent call last):
67> Failure: twisted.internet.defer.TimeoutError: <twisted.test.test_tcp.HalfCloseTestCase testMethod=testCloseWriteCloser> (testCloseWriteCloser) still running at 120.0 secs
68>
69> twisted.test.test_tcp.HalfCloseTestCase.testCloseWriteCloser
70> ===============================================================================
71> [ERROR]
72> Traceback (most recent call last):
73> Failure: twisted.trial.util.DirtyReactorAggregateError: Reactor was unclean.
74> DelayedCalls: (set twisted.internet.base.DelayedCall.debug = True to debug)
75> <DelayedCall 0x29c0462c [-6.91413879395e-05s] called=0 cancelled=0 LoopingCall<0>(check, *(), **{})()>
76>
77> twisted.test.test_tcp.HalfCloseTestCase.testCloseWriteCloser
78> ===============================================================================
79> [ERROR]
80> Traceback (most recent call last):
81> Failure: twisted.trial.util.DirtyReactorAggregateError: Reactor was unclean.
82> Selectables:
83> <<class 'twisted.internet.tcp.Port'> of twisted.test.test_tcp.MyHCFactory on 53746>
84>
85> twisted.test.test_tcp.HalfCloseTestCase.testCloseWriteCloser
86> ===============================================================================
87> [ERROR]
88> Traceback (most recent call last):
89> Failure: twisted.internet.defer.TimeoutError: <twisted.test.test_tcp.HalfCloseTestCase testMethod=testWriteCloseNotification> (testWriteCloseNotification) still running at 120.0 secs
90>
91> twisted.test.test_tcp.HalfCloseTestCase.testWriteCloseNotification
92> ===============================================================================
93> [ERROR]
94> Traceback (most recent call last):
95>   File "/home/autobahn/python/lib/python2.7/site-packages/Twisted-11.0.0-py2.7-freebsd-8.2-RELEASE-p3-i386.egg/twisted/test/test_tcp.py", line 1602, in tearDown
96>     self.assertEquals(self.client.closed, 0)
97> twisted.trial.unittest.FailTest: not equal:
98> a = 1
99> b = 0
100>
101>
102> twisted.test.test_tcp.HalfCloseTestCase.testWriteCloseNotification
103> ===============================================================================
104> [ERROR]
105> Traceback (most recent call last):
106> Failure: twisted.trial.util.DirtyReactorAggregateError: Reactor was unclean.
107> DelayedCalls: (set twisted.internet.base.DelayedCall.debug = True to debug)
108> <DelayedCall 0x2bf7f4ac [-6.29425048828e-05s] called=0 cancelled=0 LoopingCall<0>(check, *(), **{})()>
109>
110> twisted.test.test_tcp.HalfCloseTestCase.testWriteCloseNotification
1119290c9352
112< Ran 6515 tests in 102.948s
113---
114> Ran 6515 tests in 343.371s
1159292c9354
116< FAILED (skips=977, expectedFailures=11, failures=1, errors=7, successes=5519)
117---
118> FAILED (skips=977, expectedFailures=11, failures=2, errors=13, successes=5516)